{"text_format":"1","workbook":"xlsx","n_sheets":8,"sheets":["SOLICITAÇÃO","MEMORIAL DESCRITIVO","REPASSE ","Plan2","Frases-prazos-revisões","Cor - Versões - Código de Barra","Certificados Gerais","Anexo Berços"],"not_rendered":{"charts":0,"images":7,"macros":1,"external_links":1,"defined_names":82,"comments":0,"pivot_tables":0},"unopened":[],"bounds":{"document_bytes":16777216,"sheet_cells":100000,"rows_first":2000,"rows_last":500,"rows_between":2000,"halvings":0,"cell_chars":16384,"cell_head_chars":4096},"cells_cut":0,"cells_raw":0,"read":"whole","date_system":"1900"}

{"sheet":"SOLICITAÇÃO","index":0,"n_rows":51,"n_cols":4,"rows_kept":51,"cut":false,"hidden":false,"merged":[[46,3,46,4],[47,2,47,4],[48,2,48,4],[50,2,50,4],[49,3,49,4],[33,2,33,4],[34,2,34,4],[35,2,35,4],[36,2,36,4],[37,2,37,4],[43,1,43,4],[38,3,38,4],[39,3,39,4],[40,3,40,4],[41,2,41,4],[32,2,32,4],[19,2,19,4],[20,2,20,4],[21,2,21,4],[22,2,22,4],[24,1,24,4],[26,2,26,4],[27,2,27,4],[28,2,28,4],[29,2,29,4],[30,2,30,4],[31,2,31,4],[18,2,18,4],[1,1,1,4],[8,1,8,4],[10,2,10,4],[11,2,11,4],[12,2,12,4],[13,2,13,4],[14,2,14,4],[15,2,15,4],[16,2,16,4],[17,2,17,4],[5,1,5,4],[6,1,6,4]]}
[]
[null,"                                \n                                 ANÁLISE DE VIABILIDADE - BERÇO\n                 \n                               "]
[]
[null,"SOLICITAÇÃO:","-"]
[null,"MODELO DE CERTIFICAÇÃO:","-"]
[null,{"$f":"IF(C5=\"MODELO 2\",\" - Somente podem solicitar a certificação com base no Modelo de Certificação 2 os fabricantes de berços infantis que comprovem sua classificação como MPE\",\"\")","v":""}]
[null,{"$f":"IF(C5=\"MODELO 2\",\" - A opção pelo Modelo de Certificação 2 não se aplica aos importadores, comerciantes ou distribuidores de berços infantis, limitando-se aos fabricantes localizados em todo o território nacional.\",\"\")","v":""}]
[]
[null,"DADOS DA EMPRESA SOLICITANTE"]
[]
[null,"RAZÃO SOCIAL:","-"]
[null,"NOME FANTASIA:","-"]
[null,"CNPJ:","-"]
[null,"ENDEREÇO:","-"]
[null,"BAIRRO:","-"]
[null,"CEP:","-"]
[null,"CIDADE:","-"]
[null,"ESTADO:","-"]
[null,"E-MAIL:","-"]
[null,"NOME DO CONTATO:","-"]
[null,"TELEFONE: (   )","-"]
[null,"DATA DA SOLICITAÇÃO:","-"]
[null,null,"______________________________________________________________________\nAssinatura (obrigatório)"]
[]
[null,"DADOS DA FÁBRICA"]
[]
[null,"RAZÃO SOCIAL:","-"]
[null,"NOME FANTASIA:","-"]
[null,"CNPJ:","-"]
[null,"ENDEREÇO:","-"]
[null,"BAIRRO:","-"]
[null,"CEP:","-"]
[null,"CIDADE:","-"]
[null,"ESTADO:","-"]
[null,"PAÍS:","-"]
[null,"E-MAIL - FÁBRICA:","-"]
[null,"NOME DO CONTATO FÁBRICA:","-"]
[null,"TELEFONE (DDD) XXXXX-XXXX:","-"]
[null,"PROCEDÊNCIA: ","-"]
[null,"PAÍS DE ORIGEM:","-"]
[null,"POSSUI CERTIFICAÇÃO ISO 9001? (vigente)","-",{"$f":"IF(C41=\"SIM\",\"Enviar certificado com validade vigente via e-mail\",\"\")","v":""}]
[null,{"$f":"IF(C41=\"sim\",\"DESCREVA O ESCOPO DE CERTIFICAÇÃO\",\"\")","v":""},"-"]
[]
[null,"IDENTIFICAÇÃO DOS PRODUTOS"]
[]
[null,"PRODUTO COM MÚLTIPLAS CERTIFICAÇÕES (PRODUTO HÍBRIDO)?","-",{"$f":"IF(C46=\"SIM\",\"QUAL(IS)\",\"\")","v":""}]
[null,"POSSUI LICENÇA DE TERCEIROS?\n(USO DE MARCA): ","-",{"$f":"IF(C47=\"SIM\",\"Favor preencher as duas linhas abaixo\",\"\")","v":""}]
[null,{"$f":"IF(C47=\"SIM\",\"PRODUTOS LICENCIADOS:\",\"\")","v":""},"-"]
[null,{"$f":"IF(C47=\"SIM\",\"N° DA LICENÇA P/ USO DE MARCAS:\",\"\")","v":""},"-"]
[null,"EXISTE PROCESSO TERCEIRIZADO:","-"]
[null,{"$f":"IF(C50=\"SIM\",\"QUAL?\",\"\")","v":""}]

{"sheet":"MEMORIAL DESCRITIVO","index":1,"n_rows":104,"n_cols":15,"rows_kept":104,"cut":false,"hidden":false,"merged":[[102,4,102,8],[102,10,102,14],[103,10,103,14],[103,4,103,8],[9,1,9,2],[9,4,9,5],[9,7,9,8],[9,10,9,11],[9,13,9,14],[74,10,74,14],[68,10,68,14],[69,10,69,14],[70,10,70,14],[71,10,71,14],[72,10,72,14],[65,10,65,14],[65,1,65,4],[66,1,66,4],[75,1,75,4],[67,1,67,4],[76,1,76,4],[73,1,73,4],[74,1,74,4],[68,1,68,4],[8,1,8,2],[8,4,8,5],[8,7,8,8],[8,10,8,11],[8,13,8,14],[48,1,48,14],[50,11,59,14],[89,2,98,2],[89,10,98,10],[89,11,98,14],[89,4,98,4],[89,5,98,8],[87,1,87,14],[50,6,59,9],[65,5,65,9],[66,5,66,9],[75,5,75,9],[76,5,76,9],[67,5,67,9],[73,5,73,9],[73,10,73,14],[74,5,74,9],[67,10,67,14],[76,10,76,14],[72,1,72,4],[50,1,59,1],[50,2,59,5],[61,1,61,14],[66,10,66,14],[75,10,75,14],[63,1,63,14],[68,5,68,9],[69,5,69,9],[70,5,70,9],[71,5,71,9],[72,5,72,9],[50,10,59,10],[38,11,38,14],[41,11,41,14],[43,11,43,14],[42,11,42,14],[41,3,41,4],[40,3,40,4],[69,1,69,4],[70,1,70,4],[71,1,71,4],[81,16,85,17],[81,4,82,8],[84,4,85,8],[78,1,78,14],[81,9,85,9],[81,10,85,11],[80,4,80,8],[83,4,83,8],[80,10,80,11],[80,13,80,14],[80,1,85,1],[81,2,82,2],[84,2,85,2],[81,12,85,12],[81,13,85,14],[28,0,32,0],[28,1,28,2],[29,1,29,2],[30,1,30,2],[31,1,31,2],[32,1,32,2],[28,7,30,14],[32,8,32,14],[31,8,31,14],[11,1,11,14],[13,1,14,1],[13,4,14,4],[13,7,14,7],[13,10,14,10],[13,13,14,13],[19,1,20,1],[19,4,20,4],[26,1,26,14],[19,7,20,7],[1,1,1,14],[3,1,3,2],[3,4,3,8],[4,1,4,2],[4,4,4,8],[5,1,5,2],[5,4,5,8],[6,1,6,2],[6,4,6,8],[100,4,100,8],[100,10,100,14],[101,4,101,8],[101,10,101,14],[19,10,20,10],[19,13,20,13],[16,1,17,1],[16,4,17,4],[16,7,17,7],[16,10,17,10],[16,13,17,13],[34,1,34,14],[89,1,98,1],[45,3,45,4],[46,3,46,4],[42,3,42,4],[43,3,43,4],[46,11,46,14],[45,11,45,14],[44,11,44,14],[44,3,44,4],[39,3,39,4],[40,11,40,14],[39,11,39,14]]}
[]
[null,"IDENTIFICAÇÃO DO MODELO OBJETO DA CERTIFICAÇÃO"]
[]
[null,"MODELO:",null,null,"-"]
[null,"MARCA(S):",null,null,"-"]
[null,"NOME COMERCIAL:",null,null,"-"]
[null,"CÓDIGO DO FABRICANTE:",null,null,"-"]
[]
[null,{"$f":"IF(SOLICITAÇÃO!C5=\"MODELO 1b - LOTE\",\"IDENTIFICAÇÃO LOTE\",\"\")","v":""},null,null,{"$f":"IF(SOLICITAÇÃO!C5=\"MODELO 1b - LOTE\",\"QUANTIDADE DO LOTE\",\"\")","v":""},null,null,{"$f":"IF(SOLICITAÇÃO!C5=\"MODELO 1b - LOTE\",\"N° DO LOTE DE FABRICAÇÃO\",\"\")","v":""},null,null,{"$f":"IF(SOLICITAÇÃO!C5=\"MODELO 1b - LOTE\",\"LI/LPCO/DI/DUIMP\",\"\")","v":""},null,null,{"$f":"IF(SOLICITAÇÃO!C5=\"MODELO 1b - LOTE\",\"N° DO EDITAL\",\"\")","v":""}]
[]
[]
[null,"COR/VERSÕES E CÓDIGO DE BARRAS"]
[]
[null,1,{"$f":"VLOOKUP(B14,'Cor - Versões - Código de Barra'!$B$3:$D$17,2,0)","v":"-"},null,4,{"$f":"VLOOKUP(E14,'Cor - Versões - Código de Barra'!$B$3:$D$17,2,0)","v":"-"},null,7,{"$f":"VLOOKUP(H14,'Cor - Versões - Código de Barra'!$B$3:$D$17,2,0)","v":"-"},null,10,{"$f":"VLOOKUP(K14,'Cor - Versões - Código de Barra'!$B$3:$D$17,2,0)","v":"-"},null,13,{"$f":"VLOOKUP(N14,'Cor - Versões - Código de Barra'!$B$3:$D$17,2,0)","v":"-"}]
[null,null,{"$f":"VLOOKUP(B14,'Cor - Versões - Código de Barra'!$B$3:$D$17,3,0)","v":"-"},null,null,{"$f":"VLOOKUP(E14,'Cor - Versões - Código de Barra'!$B$3:$D$17,3,0)","v":"-"},null,null,{"$f":"VLOOKUP(H14,'Cor - Versões - Código de Barra'!$B$3:$D$17,3,0)","v":"-"},null,null,{"$f":"VLOOKUP(K14,'Cor - Versões - Código de Barra'!$B$3:$D$17,3,0)","v":"-"},null,null,{"$f":"VLOOKUP(N14,'Cor - Versões - Código de Barra'!$B$3:$D$17,3,0)","v":"-"}]
[]
[null,2,{"$f":"VLOOKUP(B17,'Cor - Versões - Código de Barra'!$B$3:$D$17,2,0)","v":"-"},null,5,{"$f":"VLOOKUP(E17,'Cor - Versões - Código de Barra'!$B$3:$D$17,2,0)","v":"-"},null,8,{"$f":"VLOOKUP(H17,'Cor - Versões - Código de Barra'!$B$3:$D$17,2,0)","v":"-"},null,11,{"$f":"VLOOKUP(K17,'Cor - Versões - Código de Barra'!$B$3:$D$17,2,0)","v":"-"},null,14,{"$f":"VLOOKUP(N17,'Cor - Versões - Código de Barra'!$B$3:$D$17,2,0)","v":"-"}]
[null,null,{"$f":"VLOOKUP(B17,'Cor - Versões - Código de Barra'!$B$3:$D$17,3,0)","v":"-"},null,null,{"$f":"VLOOKUP(E17,'Cor - Versões - Código de Barra'!$B$3:$D$17,3,0)","v":"-"},null,null,{"$f":"VLOOKUP(H17,'Cor - Versões - Código de Barra'!$B$3:$D$17,3,0)","v":"-"},null,null,{"$f":"VLOOKUP(K17,'Cor - Versões - Código de Barra'!$B$3:$D$17,3,0)","v":"-"},null,null,{"$f":"VLOOKUP(N17,'Cor - Versões - Código de Barra'!$B$3:$D$17,3,0)","v":"-"}]
[]
[null,3,{"$f":"VLOOKUP(B20,'Cor - Versões - Código de Barra'!$B$3:$D$17,2,0)","v":"-"},null,6,{"$f":"VLOOKUP(E20,'Cor - Versões - Código de Barra'!$B$3:$D$17,2,0)","v":"-"},null,9,{"$f":"VLOOKUP(H20,'Cor - Versões - Código de Barra'!$B$3:$D$17,2,0)","v":"-"},null,12,{"$f":"VLOOKUP(K20,'Cor - Versões - Código de Barra'!$B$3:$D$17,2,0)","v":"-"},null,15,{"$f":"VLOOKUP(N20,'Cor - Versões - Código de Barra'!$B$3:$D$17,2,0)","v":"-"}]
[null,null,{"$f":"VLOOKUP(B20,'Cor - Versões - Código de Barra'!$B$3:$D$17,3,0)","v":"-"},null,null,{"$f":"VLOOKUP(E20,'Cor - Versões - Código de Barra'!$B$3:$D$17,3,0)","v":"-"},null,null,{"$f":"VLOOKUP(H20,'Cor - Versões - Código de Barra'!$B$3:$D$17,3,0)","v":"-"},null,null,{"$f":"VLOOKUP(K20,'Cor - Versões - Código de Barra'!$B$3:$D$17,3,0)","v":"-"},null,null,{"$f":"VLOOKUP(N20,'Cor - Versões - Código de Barra'!$B$3:$D$17,3,0)","v":"-"}]
[]
[]
[]
[]
[]
[null,"CARACTERÍSTICAS CONSTRUTIVAS - COMPOSIÇÃO"]
[]
[null,"Tipo de berço:",null,null,null,"-",null,"Berço tipo 1: berços declaradamente construídos para uso de crianças com capacidade motora para sentar-se, ajoelhar-se e/ou levantar-se sozinhas, porém que ainda não sejam capazes de escalar o berço, incluindo também os berços de bases ajustáveis que podem ser utilizados em posições exclusivas para recém-nascidos, como também por crianças maiores – desde que ainda não sejam capazes de escalar o berço.\nBerço tipo 2: berços declaradamente construídos para uso de crianças que ainda não sentam, ajoelham ou levantam sozinhas."]
[null,"Material",null,null,null,"-"]
[null,"Dimensões (mm):",null,null,null,"-"]
[null,"Sistema de travamento",null,null,null,"-",null,{"$f":"IF(F32=\"Outros:\",\"Qual:\",\"\")","v":""}]
[null,"Sistema de Montagem/Ferragem ",null,null,null,"-",null,{"$f":"IF(F33=\"Outros:\",\"Qual:\",\"\")","v":""}]
[]
[null,"ACESSÓRIOS CONTIDOS: "]
[]
[null,"No caso de o berço infantil conter algum acessório, descrever sucintamente quais são os acessórios, o material empregado e as versões correspondentes."]
[]
[null,null,"Acessórios",null,null,null,null,null,"Material (Acessório)",null,null,"Versões (Acessório)"]
[null,1,"-",{"$f":"IF(C40=\"Outros:\",\"Qual:\",\"\")","v":""},null,null,null,null,"-",null,null,"-"]
[null,2,"-",{"$f":"IF(C41=\"Outros:\",\"Qual:\",\"\")","v":""},null,null,null,null,"-",null,null,"-"]
[null,3,"-","",null,null,null,null,"-",null,null,"-"]
[null,4,"-","",null,null,null,null,"-",null,null,"-"]
[null,5,"-","",null,null,null,null,"-",null,null,"-"]
[null,6,"-","",null,null,null,null,"-",null,null,"-"]
[null,7,"-","",null,null,null,null,"-",null,null,"-"]
[null,8,"-","",null,null,null,null,"-",null,null,"-"]
[]
[null,"DESENHO DO PRODUTO"]
[]
[null,"EXEMPLO","Exemplo (Imagem meramente ilustrativa)",null,null,null,"Favor inserir imagens de 800x600 dpi - mínimo",null,null,null,"DESENHO DO PRODUTO (CLIENTE):","-"]
[]
[]
[]
[]
[]
[]
[]
[]
[]
[]
[null,"RELAÇÃO DE INSUMOS\nInsumos podem ser as laterais, extremidades, base do berço, base do berço dobrável, parafusos e afins, tintas utilizadas e todos os demais componentes utilizados para a construção do berço que impactem a conformidade do produto quanto à migração de elementos tóxicos, inflamabilidade e deterioração e ataque de insetos, sejam fornecidos por empresa terceira ou produzidos pela própria empresa fabricante do produto final."]
[]
[null,"Obrigatório o preenchimento da tabela abaixo."]
[]
[null,"INSUMO",null,null,null,"MATERIAIS UTILIZADOS",null,null,null,null,"FORNECEDOR(ES)"]
[null,"-",null,null,null,"-",null,null,null,null,"-"]
[null,"-",null,null,null,"-",null,null,null,null,"-"]
[null,"-",null,null,null,"-",null,null,null,null,"-"]
[null,"-",null,null,null,"-",null,null,null,null,"-"]
[null,"-",null,null,null,"-",null,null,null,null,"-"]
[null,"-",null,null,null,"-",null,null,null,null,"-"]
[null,"-",null,null,null,"-",null,null,null,null,"-"]
[null,"-",null,null,null,"-",null,null,null,null,"-"]
[null,"-",null,null,null,"-",null,null,null,null,"-"]
[null,"-",null,null,null,"-",null,null,null,null,"-"]
[null,"-",null,null,null,"-",null,null,null,null,"-"]
[]
[null,"POSICIONAMENTO DAS MARCAÇÕES OBRIGATÓRIAS:"]
[]
[null,null,null,null,"Descreva abaixo o posicionamento no produto:",null,null,null,null,null,"1 - Imagem",null,null,"2 - Imagem"]
[null,null,"1 - Marca do fabricante e/ou importador:",null,"-",null,null,null,null,null,"Resolução mínima 800 x 600",null,null,"Resolução mínima 800 x 600"]
[]
[null,null,null,null,"Descreva abaixo o posicionamento no produto:"]
[null,null,"2 - Selo de indentificação da conformidade:",null,"-"]
[]
[]
[null,"DESENHO ESQUEMÁTICO"]
[]
[null,"EXEMPLO",null,null,"FRONTAL","-",null,null,null,null,"LATERAL","-"]
[]
[]
[]
[]
[]
[]
[]
[]
[]
[]
[null,null,null,null,"ASSINATURA DO OCP",null,null,null,null,null,"ASSINATURA DO RESPONSÁVEL DA EMPRESA (SOLICITANTE)"]
[null,null,null,null,"-",null,null,null,null,null,"-"]
[null,null,null,null,"DATA:",null,null,null,null,null,"DATA:"]
[null,null,null,null,"-",null,null,null,null,null,"-"]

{"sheet":"REPASSE ","index":2,"n_rows":28,"n_cols":3,"rows_kept":28,"cut":false,"hidden":true,"merged":[[27,1,31,1],[27,2,31,4],[9,2,9,4],[10,2,10,4],[11,2,11,4],[12,2,12,4],[13,2,13,4],[14,2,14,4],[15,2,15,4],[16,2,16,4],[18,2,18,4],[19,2,19,4],[21,2,21,4],[8,2,8,4],[1,1,1,4],[3,1,3,4],[5,2,5,4],[6,2,6,4],[7,2,7,4]]}
[]
[null,"                                \n                                 ANÁLISE DE VIABILIDADE - BERÇO\n                 \n                               "]
[]
[null,"DADOS DO EMBALADOR - (Somente em caso de repasse)"]
[]
[null,"RAZÃO SOCIAL:","-"]
[null,"NOME FANTASIA:","-"]
[null,"CNPJ:","-"]
[null,"ENDEREÇO:","-"]
[null,"BAIRRO:","-"]
[null,"CEP:","-"]
[null,"CIDADE:","-"]
[null,"ESTADO:","-"]
[null,"E-MAIL:","-"]
[null,"NOME DO CONTATO:","-"]
[null,"TELEFONE: (   )","-"]
[null,"DATA DA SOLICITAÇÃO:","-"]
[]
[null,"N° AUTORIZAÇÃO PARTICULAR DE REPASSE:","-"]
[null,"N° AUTORIZAÇÃO DE USO DA MARCA:","-"]
[]
[null,"N° DE LICENÇA DE IMPORTAÇÃO:","-"]
[]
[null,"PROCEDÊNCIA: ","-"]
[null,{"$f":"IF(C24=\"IMPORTADO\",\"PAÍS DE ORIGEM:\",\"\")","v":""},"-"]
[null,{"$f":"IF(C24=\"IMPORTADO\",\"N° DA LICENÇA DE IMPORTAÇÃO\",\"-\")","v":"-"},"-"]
[]
[null,null,"______________________________________________________________________\nAssinatura (obrigatório)\n"]

{"sheet":"Plan2","index":3,"n_rows":15,"n_cols":7,"rows_kept":15,"cut":false,"hidden":true,"merged":[]}
["-","-","-","-","-"]
["Tipo 1 ","Barra de balanço","N/A","Manual (sem ferramenta)","Sim","-","-"]
["Tipo 2","Barras laterais para mini-berço","Pressionando alavanca","Manual (com ferramenta)","Não","MODELO 2","INICIAL"]
[null,"Bolsa de transporte","Girando manípulo","Outros:",null,"MODELO 5","MANUTENÇÃO"]
[null,"Cama","Trava click",null,null,"MODELO 1b - LOTE","INCLUSÃO / REVISÃO"]
[null,"Capota","Outros:",null,null,null,"RECERTIFICAÇÃO"]
[null,"Colchão",null,null,null,null,"TRANSFERÊNCIA"]
[null,"Gaveta"]
[null,"Mobile"]
[null,"Mosquiteiro"]
[null,"Porta objeto"]
[null,"Rodízio com trava"]
[null,"Rodízio sem trava"]
[null,"Trocador"]
[null,"Outros:"]

{"sheet":"Frases-prazos-revisões","index":4,"n_rows":12,"n_cols":12,"rows_kept":12,"cut":false,"hidden":true,"merged":[[0,6,0,8]]}
[null,null,null,null,null,null,"CONTROLE DE FORMULÁRIO"]
[null,"MODELO DE CERTIFICAÇÃO","VALIDADE DO CERTIFICADO","VALIDADE DAS MANUTENÇÕES","FRASES PADRÕES PARA ESCOPO (OBSOLETAS)","FRASES PADRÕES PARA ESCOPO","FOR. Nº","REVISÃO","DATA","Atualizado por","Data","Justificativa"]
[null,"Selecionar opção"]
[null,"BERÇO - MODELO 2",{"$f":"3*12","v":36},null,"Em conformidade com requisitos da Portaria Inmetro nº 143, de 22 de março de 2021, à Norma ABNT NBR 15860-2:2016 Partes 1 e 2 para Berços e Berços dobráveis infantis tipo doméstico e à ABNT NBR 16067:2012 Partes 1 e 2 Móveis - Berços, berços de balanço ou pendular de até 900 mm para uso doméstico, comprometendo-se à certificada a cumpri-las integralmente, pelo modelo 2 de certificação, e terá validade de 3 anos.  ","Portarias aplicáveis:\nPortaria Inmetro nº 143, de 22 de março de 2021 e Portaria Inmetro nº 200, de 29 de abril de 2021.\n\nNormas aplicáveis: \nABNT NBR 15860-2:2016 Partes 1 e 2 para Berços e Berços dobráveis infantis tipo doméstico e à ABNT NBR 16067:2012 Partes 1 e 2 Móveis - Berços, berços de balanço ou pendular de até 900 mm para uso doméstico.\nNota: As normas aplicáveis utilizadas nos ensaios estão registradas no relatório específico do produto.\n\nModelo de certificação: 2.\nValidade do certificado: 3 anos.   ","FOR.10.6","Rev.00","2021-10-22","Rodrigo Balbino","2021-10-22","Foi gerado um número individual de formulário para cada escopo / modelo de certificação, considerando que para cada escopo e modelo, existe uma data de validade específica."]
[null,"BERÇO - MODELO 5",{"$f":"3*12","v":36},null,"Em conformidade com requisitos da Portaria INMETRO Nº 143, de 22 de março de 2021, à Norma ABNT NBR 15860-2:2016 Partes 1 e 2 para Berços e Berços dobráveis infantis tipo doméstico e à ABNT NBR 16067:2012 Partes 1 e 2 Móveis - Berços, berços de balanço ou pendular de até 900 mm para uso doméstico, comprometendo-se à certificada a cumpri-las integralmente, pelo modelo 5 de certificação, e terá validade de 3 anos. ","Portarias aplicáveis:\nPortaria Inmetro nº 143, de 22 de março de 2021 e Portaria Inmetro nº 200, de 29 de abril de 2021.\n\nNormas aplicáveis: \nABNT NBR 15860-2:2016 Partes 1 e 2 para Berços e Berços dobráveis infantis tipo doméstico e à ABNT NBR 16067:2012 Partes 1 e 2 Móveis - Berços, berços de balanço ou pendular de até 900 mm para uso doméstico.\nNota: As normas aplicáveis utilizadas nos ensaios estão registradas no relatório específico do produto.\n\nModelo de certificação: 5\nValidade do certificado: 3 anos.   ","FOR.10.7","Rev.00","2021-10-22","Rodrigo Balbino","2021-10-22","Foi gerado um número individual de formulário para cada escopo / modelo de certificação, considerando que para cada escopo e modelo, existe uma data de validade específica."]
[null,"BERÇO - MODELO 1b",{"$f":"10*12","v":120},null,"Em conformidade com requisitos da Portaria Inmetro nº 143, de 22 de março de 2021, à Norma ABNT NBR 15860-2:2016 Partes 1 e 2 para Berços e Berços dobráveis infantis tipo doméstico e à ABNT NBR 16067:2012 Partes 1 e 2 Móveis - Berços, berços de balanço ou pendular de até 900 mm para uso doméstico, comprometendo-se à certificada a cumpri-las integralmente, pelo modelo 1b de certificação, e terá validade de 3 anos. ","Portarias aplicáveis:\nPortaria Inmetro nº 143, de 22 de março de 2021 e Portaria Inmetro nº 200, de 29 de abril de 2021.\n\nNormas aplicáveis: \nABNT NBR 15860-2:2016 Partes 1 e 2 para Berços e Berços dobráveis infantis tipo doméstico e à ABNT NBR 16067:2012 Partes 1 e 2 Móveis - Berços, berços de balanço ou pendular de até 900 mm para uso doméstico.\nNota: As normas aplicáveis utilizadas nos ensaios estão registradas no relatório específico do produto.\n\nModelo de certificação: 1b\nValidade do certificado: 10 anos.   ","FOR.10.8","Rev.00","2021-10-22","Rodrigo Balbino","2021-10-22","Foi gerado um número individual de formulário para cada escopo / modelo de certificação, considerando que para cada escopo e modelo, existe uma data de validade específica."]
[null,"BERÇO - MODELO 2",{"$f":"3*12","v":36},null,"Em conformidade com requisitos da Portaria Inmetro nº 143, de 22 de março de 2021, à Norma ABNT NBR 15860-2:2016 Partes 1 e 2 para Berços e Berços dobráveis infantis tipo doméstico e à ABNT NBR 16067:2012 Partes 1 e 2 Móveis - Berços, berços de balanço ou pendular de até 900 mm para uso doméstico, comprometendo-se à certificada a cumpri-las integralmente, pelo modelo 2 de certificação, e terá validade de 3 anos.  ","Portarias aplicáveis:\nPortaria Inmetro nº 143, de 22 de março de 2021 e Portaria Inmetro nº 200, de 29 de abril de 2021.\n\nNormas aplicáveis: \nABNT NBR 15860-2:2016 Partes 1 e 2 para Berços e Berços dobráveis infantis tipo doméstico e à ABNT NBR 16067:2012 Partes 1 e 2 Móveis - Berços, berços de balanço ou pendular de até 900 mm para uso doméstico.\nNota: As normas aplicáveis utilizadas nos ensaios estão registradas no relatório específico do produto.\n\nModelo de certificação: 2.\nValidade do certificado: 3 anos.   ","FOR.10.6","Rev.01","2022-06-29","Alexandre Colombo","2022-06-29","Realizado atualização de endereço conforme CNPJ"]
[null,"BERÇO - MODELO 5",{"$f":"3*12","v":36},null,"Em conformidade com requisitos da Portaria INMETRO Nº 143, de 22 de março de 2021, à Norma ABNT NBR 15860-2:2016 Partes 1 e 2 para Berços e Berços dobráveis infantis tipo doméstico e à ABNT NBR 16067:2012 Partes 1 e 2 Móveis - Berços, berços de balanço ou pendular de até 900 mm para uso doméstico, comprometendo-se à certificada a cumpri-las integralmente, pelo modelo 5 de certificação, e terá validade de 3 anos. ","Portarias aplicáveis:\nPortaria Inmetro nº 143, de 22 de março de 2021 e Portaria Inmetro nº 200, de 29 de abril de 2021.\n\nNormas aplicáveis: \nABNT NBR 15860-2:2016 Partes 1 e 2 para Berços e Berços dobráveis infantis tipo doméstico e à ABNT NBR 16067:2012 Partes 1 e 2 Móveis - Berços, berços de balanço ou pendular de até 900 mm para uso doméstico.\nNota: As normas aplicáveis utilizadas nos ensaios estão registradas no relatório específico do produto.\n\nModelo de certificação: 5\nValidade do certificado: 3 anos.   ","FOR.10.7","Rev.01","2022-06-29","Alexandre Colombo","2022-06-29","Realizado atualização de endereço conforme CNPJ"]
[null,"BERÇO - MODELO 1b",{"$f":"10*12","v":120},null,"Em conformidade com requisitos da Portaria Inmetro nº 143, de 22 de março de 2021, à Norma ABNT NBR 15860-2:2016 Partes 1 e 2 para Berços e Berços dobráveis infantis tipo doméstico e à ABNT NBR 16067:2012 Partes 1 e 2 Móveis - Berços, berços de balanço ou pendular de até 900 mm para uso doméstico, comprometendo-se à certificada a cumpri-las integralmente, pelo modelo 1b de certificação, e terá validade de 3 anos. ","Portarias aplicáveis:\nPortaria Inmetro nº 143, de 22 de março de 2021 e Portaria Inmetro nº 200, de 29 de abril de 2021.\n\nNormas aplicáveis: \nABNT NBR 15860-2:2016 Partes 1 e 2 para Berços e Berços dobráveis infantis tipo doméstico e à ABNT NBR 16067:2012 Partes 1 e 2 Móveis - Berços, berços de balanço ou pendular de até 900 mm para uso doméstico.\nNota: As normas aplicáveis utilizadas nos ensaios estão registradas no relatório específico do produto.\n\nModelo de certificação: 1b\nValidade do certificado: Indeterminado.   ","FOR.10.8","Rev.01","2022-06-29","Alexandre Colombo","2022-06-29","Realizado atualização de endereço conforme CNPJ"]
[null,"BERÇO - MODELO 2",{"$f":"3*12","v":36},null,"Em conformidade com requisitos da Portaria Inmetro nº 143, de 22 de março de 2021, à Norma ABNT NBR 15860-2:2016 Partes 1 e 2 para Berços e Berços dobráveis infantis tipo doméstico e à ABNT NBR 16067:2012 Partes 1 e 2 Móveis - Berços, berços de balanço ou pendular de até 900 mm para uso doméstico, comprometendo-se à certificada a cumpri-las integralmente, pelo modelo 2 de certificação, e terá validade de 3 anos.  ","Portarias aplicáveis:\nPortaria Inmetro nº 143, de 22 de março de 2021 e Portaria Inmetro nº 200, de 29 de abril de 2021.\n\nNormas aplicáveis: \nABNT NBR 15860-2:2016 Partes 1 e 2 para Berços e Berços dobráveis infantis tipo doméstico e à ABNT NBR 16067:2012 Partes 1 e 2 Móveis - Berços, berços de balanço ou pendular de até 900 mm para uso doméstico.\nNota: As normas aplicáveis utilizadas nos ensaios estão registradas no relatório específico do produto.\n\nModelo de certificação: 2.\nValidade do certificado: 3 anos.   ","FOR.10.6","Rev.02","2022-09-08","Alexandre Colombo","2022-09-08","Reformulação geral do registro"]
[null,"BERÇO - MODELO 5",{"$f":"3*12","v":36},null,"Em conformidade com requisitos da Portaria INMETRO Nº 143, de 22 de março de 2021, à Norma ABNT NBR 15860-2:2016 Partes 1 e 2 para Berços e Berços dobráveis infantis tipo doméstico e à ABNT NBR 16067:2012 Partes 1 e 2 Móveis - Berços, berços de balanço ou pendular de até 900 mm para uso doméstico, comprometendo-se à certificada a cumpri-las integralmente, pelo modelo 5 de certificação, e terá validade de 3 anos. ","Portarias aplicáveis:\nPortaria Inmetro nº 143, de 22 de março de 2021 e Portaria Inmetro nº 200, de 29 de abril de 2021.\n\nNormas aplicáveis: \nABNT NBR 15860-2:2016 Partes 1 e 2 para Berços e Berços dobráveis infantis tipo doméstico e à ABNT NBR 16067:2012 Partes 1 e 2 Móveis - Berços, berços de balanço ou pendular de até 900 mm para uso doméstico.\nNota: As normas aplicáveis utilizadas nos ensaios estão registradas no relatório específico do produto.\n\nModelo de certificação: 5\nValidade do certificado: 3 anos.   ","FOR.10.7","Rev.02","2022-09-08","Alexandre Colombo","2022-09-08","Reformulação geral do registro"]
[null,"BERÇO - MODELO 1b",{"$f":"10*12","v":120},null,"Em conformidade com requisitos da Portaria Inmetro nº 143, de 22 de março de 2021, à Norma ABNT NBR 15860-2:2016 Partes 1 e 2 para Berços e Berços dobráveis infantis tipo doméstico e à ABNT NBR 16067:2012 Partes 1 e 2 Móveis - Berços, berços de balanço ou pendular de até 900 mm para uso doméstico, comprometendo-se à certificada a cumpri-las integralmente, pelo modelo 1b de certificação, e terá validade de 3 anos. ","Portarias aplicáveis:\nPortaria Inmetro nº 143, de 22 de março de 2021 e Portaria Inmetro nº 200, de 29 de abril de 2021.\n\nNormas aplicáveis: \nABNT NBR 15860-2:2016 Partes 1 e 2 para Berços e Berços dobráveis infantis tipo doméstico e à ABNT NBR 16067:2012 Partes 1 e 2 Móveis - Berços, berços de balanço ou pendular de até 900 mm para uso doméstico.\nNota: As normas aplicáveis utilizadas nos ensaios estão registradas no relatório específico do produto.\n\nModelo de certificação: 1b\nValidade do certificado: Indeterminado.   ","FOR.10.8","Rev.02","2022-09-08","Alexandre Colombo","2022-09-08","Reformulação geral do registro"]

{"sheet":"Cor - Versões - Código de Barra","index":5,"n_rows":18,"n_cols":4,"rows_kept":18,"cut":false,"hidden":false,"merged":[]}
[]
[null,null,"COR/VERSÕES"," CÓDIGO DE BARRAS"]
[null,1,"-","-"]
[null,2,"-","-"]
[null,3,"-","-"]
[null,4,"-","-"]
[null,5,"-","-"]
[null,6,"-","-"]
[null,7,"-","-"]
[null,8,"-","-"]
[null,9,"-","-"]
[null,10,"-","-"]
[null,11,"-","-"]
[null,12,"-","-"]
[null,13,"-","-"]
[null,14,"-","-"]
[null,15,"-","-"]
[null,null,"-",123123132132]

{"sheet":"Certificados Gerais","index":6,"n_rows":36,"n_cols":31,"rows_kept":36,"cut":false,"hidden":true,"merged":[[0,26,2,26],[3,26,5,26],[0,22,0,25],[965,1,965,3],[965,4,965,8],[965,9,965,13],[965,14,965,18],[965,19,965,21],[965,22,965,24],[964,1,964,3],[964,4,964,8],[964,9,964,13],[964,14,964,18],[964,19,964,21],[964,22,964,24],[963,1,963,3],[963,4,963,8],[963,9,963,13],[963,14,963,18],[963,19,963,21],[963,22,963,24],[962,1,962,3],[962,4,962,8],[962,9,962,13],[962,14,962,18],[962,19,962,21],[962,22,962,24],[961,1,961,3],[961,4,961,8],[961,9,961,13],[961,14,961,18],[961,19,961,21],[961,22,961,24],[960,1,960,3],[968,1,968,3],[968,4,968,8],[968,9,968,13],[968,14,968,18],[968,19,968,21],[968,22,968,24],[967,1,967,3],[967,4,967,8],[967,9,967,13],[967,14,967,18],[967,19,967,21],[967,22,967,24],[966,1,966,3],[966,4,966,8],[966,9,966,13],[966,14,966,18],[966,19,966,21],[966,22,966,24],[960,4,960,8],[960,9,960,13],[960,14,960,18],[960,19,960,21],[960,22,960,24],[959,1,959,3],[959,4,959,8],[959,9,959,13],[959,14,959,18],[959,19,959,21],[959,22,959,24],[958,1,958,3],[958,4,958,8],[958,9,958,13],[958,14,958,18],[958,19,958,21],[958,22,958,24],[957,1,957,3],[957,4,957,8],[957,9,957,13],[957,14,957,18],[957,19,957,21],[957,22,957,24],[956,1,956,3],[956,4,956,8],[956,9,956,13],[956,14,956,18],[956,19,956,21],[956,22,956,24],[955,1,955,3],[955,4,955,8],[955,9,955,13],[955,14,955,18],[955,19,955,21],[955,22,955,24],[954,1,954,3],[954,4,954,8],[954,9,954,13],[954,14,954,18],[954,19,954,21],[954,22,954,24],[953,1,953,3],[953,4,953,8],[953,9,953,13],[953,14,953,18],[953,19,953,21],[953,22,953,24],[952,1,952,3],[952,4,952,8],[952,9,952,13],[952,14,952,18],[952,19,952,21],[952,22,952,24],[951,1,951,3],[951,4,951,8],[951,9,951,13],[951,14,951,18],[951,19,951,21],[951,22,951,24],[950,1,950,3],[950,4,950,8],[950,9,950,13],[950,14,950,18],[950,19,950,21],[950,22,950,24],[949,1,949,3],[949,4,949,8],[949,9,949,13],[949,14,949,18],[949,19,949,21],[949,22,949,24],[948,1,948,3],[948,4,948,8],[948,9,948,13],[948,14,948,18],[948,19,948,21],[948,22,948,24],[947,1,947,3],[947,4,947,8],[947,9,947,13],[947,14,947,18],[947,19,947,21],[947,22,947,24],[946,1,946,3],[946,4,946,8],[946,9,946,13],[946,14,946,18],[946,19,946,21],[946,22,946,24],[945,1,945,3],[945,4,945,8],[945,9,945,13],[945,14,945,18],[945,19,945,21],[945,22,945,24],[944,1,944,3],[944,4,944,8],[944,9,944,13],[944,14,944,18],[944,19,944,21],[944,22,944,24],[943,1,943,3],[943,4,943,8],[943,9,943,13],[943,14,943,18],[943,19,943,21],[943,22,943,24],[942,1,942,3],[942,4,942,8],[942,9,942,13],[942,14,942,18],[942,19,942,21],[942,22,942,24],[941,1,941,3],[941,4,941,8],[941,9,941,13],[941,14,941,18],[941,19,941,21],[941,22,941,24],[940,1,940,3],[940,4,940,8],[940,9,940,13],[940,14,940,18],[940,19,940,21],[940,22,940,24],[939,1,939,3],[939,4,939,8],[939,9,939,13],[939,14,939,18],[939,19,939,21],[939,22,939,24],[938,1,938,3],[938,4,938,8],[938,9,938,13],[938,14,938,18],[938,19,938,21],[938,22,938,24],[937,1,937,3],[937,4,937,8],[937,9,937,13],[937,14,937,18],[937,19,937,21],[937,22,937,24],[936,1,936,3],[936,4,936,8],[936,9,936,13],[936,14,936,18],[936,19,936,21],[936,22,936,24],[935,1,935,3],[935,4,935,8],[935,9,935,13],[935,14,935,18],[935,19,935,21],[935,22,935,24],[934,1,934,3],[934,4,934,8],[934,9,934,13],[934,14,934,18],[934,19,934,21],[934,22,934,24],[933,1,933,3],[933,4,933,8],[933,9,933,13],[933,14,933,18],[933,19,933,21],[933,22,933,24],[932,1,932,3],[932,4,932,8],[932,9,932,13],[932,14,932,18],[932,19,932,21],[932,22,932,24],[931,1,931,3],[931,4,931,8],[931,9,931,13],[931,14,931,18],[931,19,931,21],[931,22,931,24],[930,1,930,3],[930,4,930,8],[930,9,930,13],[930,14,930,18],[930,19,930,21],[930,22,930,24],[929,1,929,3],[929,4,929,8],[929,9,929,13],[929,14,929,18],[929,19,929,21],[929,22,929,24],[928,1,928,3],[928,4,928,8],[928,9,928,13],[928,14,928,18],[928,19,928,21],[928,22,928,24],[927,1,927,3],[927,4,927,8],[927,9,927,13],[927,14,927,18],[927,19,927,21],[927,22,927,24],[926,1,926,3],[926,4,926,8],[926,9,926,13],[926,14,926,18],[926,19,926,21],[926,22,926,24],[925,1,925,3],[925,4,925,8],[925,9,925,13],[925,14,925,18],[925,19,925,21],[925,22,925,24],[924,1,924,3],[924,4,924,8],[924,9,924,13],[924,14,924,18],[924,19,924,21],[924,22,924,24],[923,1,923,3],[923,4,923,8],[923,9,923,13],[923,14,923,18],[923,19,923,21],[923,22,923,24],[922,1,922,3],[922,4,922,8],[922,9,922,13],[922,14,922,18],[922,19,922,21],[922,22,922,24],[921,1,921,3],[921,4,921,8],[921,9,921,13],[921,14,921,18],[921,19,921,21],[921,22,921,24],[920,1,920,3],[920,4,920,8],[920,9,920,13],[920,14,920,18],[920,19,920,21],[920,22,920,24],[919,1,919,3],[919,4,919,8],[919,9,919,13],[919,14,919,18],[919,19,919,21],[919,22,919,24],[918,1,918,3],[918,4,918,8],[918,9,918,13],[918,14,918,18],[918,19,918,21],[918,22,918,24],[917,1,917,3],[917,4,917,8],[917,9,917,13],[917,14,917,18],[917,19,917,21],[917,22,917,24],[916,1,916,3],[916,4,916,8],[916,9,916,13],[916,14,916,18],[916,19,916,21],[916,22,916,24],[915,1,915,3],[915,4,915,8],[915,9,915,13],[915,14,915,18],[915,19,915,21],[915,22,915,24],[914,1,914,3],[914,4,914,8],[914,9,914,13],[914,14,914,18],[914,19,914,21],[914,22,914,24],[913,1,913,3],[913,4,913,8],[913,9,913,13],[913,14,913,18],[913,19,913,21],[913,22,913,24],[912,1,912,3],[912,4,912,8],[912,9,912,13],[912,14,912,18],[912,19,912,21],[912,22,912,24],[911,1,911,3],[911,4,911,8],[911,9,911,13],[911,14,911,18],[911,19,911,21],[911,22,911,24],[910,1,910,3],[910,4,910,8],[910,9,910,13],[910,14,910,18],[910,19,910,21],[910,22,910,24],[909,1,909,3],[909,4,909,8],[909,9,909,13],[909,14,909,18],[909,19,909,21],[909,22,909,24],[908,1,908,3],[908,4,908,8],[908,9,908,13],[908,14,908,18],[908,19,908,21],[908,22,908,24],[907,1,907,3],[907,4,907,8],[907,9,907,13],[907,14,907,18],[907,19,907,21],[907,22,907,24],[906,1,906,3],[906,4,906,8],[906,9,906,13],[906,14,906,18],[906,19,906,21],[906,22,906,24],[905,1,905,3],[905,4,905,8],[905,9,905,13],[905,14,905,18],[905,19,905,21],[905,22,905,24],[904,1,904,3],[904,4,904,8],[904,9,904,13],[904,14,904,18],[904,19,904,21],[904,22,904,24],[903,1,903,3],[903,4,903,8],[903,9,903,13],[903,14,903,18],[903,19,903,21],[903,22,903,24],[902,1,902,3],[902,4,902,8],[902,9,902,13],[902,14,902,18],[902,19,902,21],[902,22,902,24],[901,1,901,3],[901,4,901,8],[901,9,901,13],[901,14,901,18],[901,19,901,21],[901,22,901,24],[900,1,900,3],[900,4,900,8],[900,9,900,13],[900,14,900,18],[900,19,900,21],[900,22,900,24],[899,1,899,3],[899,4,899,8],[899,9,899,13],[899,14,899,18],[899,19,899,21],[899,22,899,24],[898,1,898,3],[898,4,898,8],[898,9,898,13],[898,14,898,18],[898,19,898,21],[898,22,898,24],[897,1,897,3],[897,4,897,8],[897,9,897,13],[897,14,897,18],[897,19,897,21],[897,22,897,24],[896,1,896,3],[896,4,896,8],[896,9,896,13],[896,14,896,18],[896,19,896,21],[896,22,896,24],[895,1,895,3],[895,4,895,8],[895,9,895,13],[895,14,895,18],[895,19,895,21],[895,22,895,24],[894,1,894,3],[894,4,894,8],[894,9,894,13],[894,14,894,18],[894,19,894,21],[894,22,894,24],[893,1,893,3],[893,4,893,8],[893,9,893,13],[893,14,893,18],[893,19,893,21],[893,22,893,24],[892,1,892,3],[892,4,892,8],[892,9,892,13],[892,14,892,18],[892,19,892,21],[892,22,892,24],[891,1,891,3],[891,4,891,8],[891,9,891,13],[891,14,891,18],[891,19,891,21],[891,22,891,24],[890,1,890,3],[890,4,890,8],[890,9,890,13],[890,14,890,18],[890,19,890,21],[890,22,890,24],[889,1,889,3],[889,4,889,8],[889,9,889,13],[889,14,889,18],[889,19,889,21],[889,22,889,24],[888,1,888,3],[888,4,888,8],[888,9,888,13],[888,14,888,18],[888,19,888,21],[888,22,888,24],[887,1,887,3],[887,4,887,8],[887,9,887,13],[887,14,887,18],[887,19,887,21],[887,22,887,24],[886,1,886,3],[886,4,886,8],[886,9,886,13],[886,14,886,18],[886,19,886,21],[886,22,886,24],[885,1,885,3],[885,4,885,8],[885,9,885,13],[885,14,885,18],[885,19,885,21],[885,22,885,24],[884,1,884,3],[884,4,884,8],[884,9,884,13],[884,14,884,18],[884,19,884,21],[884,22,884,24],[883,1,883,3],[883,4,883,8],[883,9,883,13],[883,14,883,18],[883,19,883,21],[883,22,883,24],[882,1,882,3],[882,4,882,8],[882,9,882,13],[882,14,882,18],[882,19,882,21],[882,22,882,24],[881,1,881,3],[881,4,881,8],[881,9,881,13],[881,14,881,18],[881,19,881,21],[881,22,881,24],[880,1,880,3],[880,4,880,8],[880,9,880,13],[880,14,880,18],[880,19,880,21],[880,22,880,24],[879,1,879,3],[879,4,879,8],[879,9,879,13],[879,14,879,18],[879,19,879,21],[879,22,879,24],[878,1,878,3],[878,4,878,8],[878,9,878,13],[878,14,878,18],[878,19,878,21],[878,22,878,24],[877,1,877,3],[877,4,877,8],[877,9,877,13],[877,14,877,18],[877,19,877,21],[877,22,877,24],[876,1,876,3],[876,4,876,8],[876,9,876,13],[876,14,876,18],[876,19,876,21],[876,22,876,24],[875,1,875,3],[875,4,875,8],[875,9,875,13],[875,14,875,18],[875,19,875,21],[875,22,875,24],[874,1,874,3],[874,4,874,8],[874,9,874,13],[874,14,874,18],[874,19,874,21],[874,22,874,24],[873,1,873,3],[873,4,873,8],[873,9,873,13],[873,14,873,18],[873,19,873,21],[873,22,873,24],[872,1,872,3],[872,4,872,8],[872,9,872,13],[872,14,872,18],[872,19,872,21],[872,22,872,24],[871,1,871,3],[871,4,871,8],[871,9,871,13],[871,14,871,18],[871,19,871,21],[871,22,871,24],[870,1,870,3],[870,4,870,8],[870,9,870,13],[870,14,870,18],[870,19,870,21],[870,22,870,24],[869,1,869,3],[869,4,869,8],[869,9,869,13],[869,14,869,18],[869,19,869,21],[869,22,869,24],[868,1,868,3],[868,4,868,8],[868,9,868,13],[868,14,868,18],[868,19,868,21],[868,22,868,24],[867,1,867,3],[867,4,867,8],[867,9,867,13],[867,14,867,18],[867,19,867,21],[867,22,867,24],[866,1,866,3],[866,4,866,8],[866,9,866,13],[866,14,866,18],[866,19,866,21],[866,22,866,24],[865,1,865,3],[865,4,865,8],[865,9,865,13],[865,14,865,18],[865,19,865,21],[865,22,865,24],[864,1,864,3],[864,4,864,8],[864,9,864,13],[864,14,864,18],[864,19,864,21],[864,22,864,24],[863,1,863,3],[863,4,863,8],[863,9,863,13],[863,14,863,18],[863,19,863,21],[863,22,863,24],[862,1,862,3],[862,4,862,8],[862,9,862,13],[862,14,862,18],[862,19,862,21],[862,22,862,24],[861,1,861,3],[861,4,861,8],[861,9,861,13],[861,14,861,18],[861,19,861,21],[861,22,861,24],[860,1,860,3],[860,4,860,8],[860,9,860,13],[860,14,860,18],[860,19,860,21],[860,22,860,24],[859,1,859,3],[859,4,859,8],[859,9,859,13],[859,14,859,18],[859,19,859,21],[859,22,859,24],[858,1,858,3],[858,4,858,8],[858,9,858,13],[858,14,858,18],[858,19,858,21],[858,22,858,24],[857,1,857,3],[857,4,857,8],[857,9,857,13],[857,14,857,18],[857,19,857,21],[857,22,857,24],[856,1,856,3],[856,4,856,8],[856,9,856,13],[856,14,856,18],[856,19,856,21],[856,22,856,24],[855,1,855,3],[855,4,855,8],[855,9,855,13],[855,14,855,18],[855,19,855,21],[855,22,855,24],[854,1,854,3],[854,4,854,8],[854,9,854,13],[854,14,854,18],[854,19,854,21],[854,22,854,24],[853,1,853,3],[853,4,853,8],[853,9,853,13],[853,14,853,18],[853,19,853,21],[853,22,853,24],[852,1,852,3],[852,4,852,8],[852,9,852,13],[852,14,852,18],[852,19,852,21],[852,22,852,24],[851,1,851,3],[851,4,851,8],[851,9,851,13],[851,14,851,18],[851,19,851,21],[851,22,851,24],[850,1,850,3],[850,4,850,8],[850,9,850,13],[850,14,850,18],[850,19,850,21],[850,22,850,24],[849,1,849,3],[849,4,849,8],[849,9,849,13],[849,14,849,18],[849,19,849,21],[849,22,849,24],[848,1,848,3],[848,4,848,8],[848,9,848,13],[848,14,848,18],[848,19,848,21],[848,22,848,24],[847,1,847,3],[847,4,847,8],[847,9,847,13],[847,14,847,18],[847,19,847,21],[847,22,847,24],[846,1,846,3],[846,4,846,8],[846,9,846,13],[846,14,846,18],[846,19,846,21],[846,22,846,24],[845,1,845,3],[845,4,845,8],[845,9,845,13],[845,14,845,18],[845,19,845,21],[845,22,845,24],[844,1,844,3],[844,4,844,8],[844,9,844,13],[844,14,844,18],[844,19,844,21],[844,22,844,24],[843,1,843,3],[843,4,843,8],[843,9,843,13],[843,14,843,18],[843,19,843,21],[843,22,843,24],[842,1,842,3],[842,4,842,8],[842,9,842,13],[842,14,842,18],[842,19,842,21],[842,22,842,24],[841,1,841,3],[841,4,841,8],[841,9,841,13],[841,14,841,18],[841,19,841,21],[841,22,841,24],[840,1,840,3],[840,4,840,8],[840,9,840,13],[840,14,840,18],[840,19,840,21],[840,22,840,24],[839,1,839,3],[839,4,839,8],[839,9,839,13],[839,14,839,18],[839,19,839,21],[839,22,839,24],[838,1,838,3],[838,4,838,8],[838,9,838,13],[838,14,838,18],[838,19,838,21],[838,22,838,24],[837,1,837,3],[837,4,837,8],[837,9,837,13],[837,14,837,18],[837,19,837,21],[837,22,837,24],[836,1,836,3],[836,4,836,8],[836,9,836,13],[836,14,836,18],[836,19,836,21],[836,22,836,24],[835,1,835,3],[835,4,835,8],[835,9,835,13],[835,14,835,18],[835,19,835,21],[835,22,835,24],[834,1,834,3],[834,4,834,8],[834,9,834,13],[834,14,834,18],[834,19,834,21],[834,22,834,24],[833,1,833,3],[833,4,833,8],[833,9,833,13],[833,14,833,18],[833,19,833,21],[833,22,833,24],[832,1,832,3],[832,4,832,8],[832,9,832,13],[832,14,832,18],[832,19,832,21],[832,22,832,24],[831,1,831,3],[831,4,831,8],[831,9,831,13],[831,14,831,18],[831,19,831,21],[831,22,831,24],[830,1,830,3],[830,4,830,8],[830,9,830,13],[830,14,830,18],[830,19,830,21],[830,22,830,24],[829,1,829,3],[829,4,829,8],[829,9,829,13],[829,14,829,18],[829,19,829,21],[829,22,829,24],[828,1,828,3],[828,4,828,8],[828,9,828,13],[828,14,828,18],[828,19,828,21],[828,22,828,24],[827,1,827,3],[827,4,827,8],[827,9,827,13],[827,14,827,18],[827,19,827,21],[827,22,827,24],[826,1,826,3],[826,4,826,8],[826,9,826,13],[826,14,826,18],[826,19,826,21],[826,22,826,24],[825,1,825,3],[825,4,825,8],[825,9,825,13],[825,14,825,18],[825,19,825,21],[825,22,825,24],[824,1,824,3],[824,4,824,8],[824,9,824,13],[824,14,824,18],[824,19,824,21],[824,22,824,24],[823,1,823,3],[823,4,823,8],[823,9,823,13],[823,14,823,18],[823,19,823,21],[823,22,823,24],[822,1,822,3],[822,4,822,8],[822,9,822,13],[822,14,822,18],[822,19,822,21],[822,22,822,24],[821,1,821,3],[821,4,821,8],[821,9,821,13],[821,14,821,18],[821,19,821,21],[821,22,821,24],[820,1,820,3],[820,4,820,8],[820,9,820,13],[820,14,820,18],[820,19,820,21],[820,22,820,24],[819,1,819,3],[819,4,819,8],[819,9,819,13],[819,14,819,18],[819,19,819,21],[819,22,819,24],[818,1,818,3],[818,4,818,8],[818,9,818,13],[818,14,818,18],[818,19,818,21],[818,22,818,24],[817,1,817,3],[817,4,817,8],[817,9,817,13],[817,14,817,18],[817,19,817,21],[817,22,817,24],[816,1,816,3],[816,4,816,8],[816,9,816,13],[816,14,816,18],[816,19,816,21],[816,22,816,24],[815,1,815,3],[815,4,815,8],[815,9,815,13],[815,14,815,18],[815,19,815,21],[815,22,815,24],[814,1,814,3],[814,4,814,8],[814,9,814,13],[814,14,814,18],[814,19,814,21],[814,22,814,24],[813,1,813,3],[813,4,813,8],[813,9,813,13],[813,14,813,18],[813,19,813,21],[813,22,813,24],[812,1,812,3],[812,4,812,8],[812,9,812,13],[812,14,812,18],[812,19,812,21],[812,22,812,24],[811,1,811,3],[811,4,811,8],[811,9,811,13],[811,14,811,18],[811,19,811,21],[811,22,811,24],[810,1,810,3],[810,4,810,8],[810,9,810,13],[810,14,810,18],[810,19,810,21],[810,22,810,24],[809,1,809,3],[809,4,809,8],[809,9,809,13],[809,14,809,18],[809,19,809,21],[809,22,809,24],[808,1,808,3],[808,4,808,8],[808,9,808,13],[808,14,808,18],[808,19,808,21],[808,22,808,24],[807,1,807,3],[807,4,807,8],[807,9,807,13],[807,14,807,18],[807,19,807,21],[807,22,807,24],[806,1,806,3],[806,4,806,8],[806,9,806,13],[806,14,806,18],[806,19,806,21],[806,22,806,24],[805,1,805,3],[805,4,805,8],[805,9,805,13],[805,14,805,18],[805,19,805,21],[805,22,805,24],[804,1,804,3],[804,4,804,8],[804,9,804,13],[804,14,804,18],[804,19,804,21],[804,22,804,24],[803,1,803,3],[803,4,803,8],[803,9,803,13],[803,14,803,18],[803,19,803,21],[803,22,803,24],[802,1,802,3]],"merged_total":5654,"flags":["merged_cut"]}
[null,null,null,null,null,null,null,null,null,null,null,null,null,null,null,null,null,null,null,null,null,null,null,null,null,null,{"$f":"VLOOKUP(AB4,'Frases-prazos-revisões'!B10:L12,8,0)","v":{"$error":"#N/A"}}]
[null,"Selecionar opção",null,null,null,null,null,null,null,null,null,null,null,null,null,null,null,null,null,null,null,null,null,null,null,null,null,"Modelo de certificação",null,"Periodo de validade"]
[null,"Berços infantis",null,null,null,null,null,null,null,null,null,null,null,null,null,null,null,null,null,null,null,null,null,null,null,null,null,null,null,"Em meses","Em anos"]
[null,null,null,null,null,null,null,null,null,null,null,null,null,null,null,null,null,null,null,null,null,null,null,null,null,null,{"$f":"VLOOKUP(AB4,'Frases-prazos-revisões'!B10:L12,6,0)&\" -\"&VLOOKUP(AB4,'Frases-prazos-revisões'!B10:L12,7,0)&\"  -\"","v":{"$error":"#N/A"}},"Selecionar opção",null,{"$f":"IF(AB4=\"Selecionar opção\",\"\",VLOOKUP(AB4,'Frases-prazos-revisões'!B:C,2,FALSE))","v":""},{"$f":"IF(AB4=\"Selecionar opção\",\"\",(AD4/12))","v":""}]
[null,{"$f":"\"CERTIFICADO N°: \"&IF(IF(B2=\"CERTIFICADO DE CONFORMIDADE\",G21,AB6)=0,\"\",IF(B2=\"CERTIFICADO DE CONFORMIDADE\",G21,AB6))&AB9","v":"CERTIFICADO N°: "}]
[null,{"$f":"IF(AB4=\"Selecionar opção\",\"Selecionar modelo de certificação\",VLOOKUP(AB4,'Frases-prazos-revisões'!B7:F9,5,0))","v":"Selecionar modelo de certificação"}]
[null,{"$f":"IF(AB4=\"BRINQUEDOS - MODELO 4 - Portaria 321\",\"Concessão:\",IF(AB4=\"BRINQUEDOS - MODELO 5 - Portaria 321 - 4 mêses\",\"Concessão:\",IF(AB4=\"BRINQUEDOS - MODELO 5 - Portaria 321 - 8 mêses\",\"Concessão:\",IF(AB4=\"BRINQUEDOS - MODELO 5 - Portaria 321 - 12 mêses\",\"Concessão:\",IF(AB4=\"BRINQUEDOS - MODELO 1b - Portaria 321\",\"Concessão:\",IF(OR(AB4<>\"BRINQUEDOS - MODELO 4 - Portaria 321\",AB4<>\"BRINQUEDOS - MODELO 5 - Portaria 321 - 4 mêses\",AB4<>\"BRINQUEDOS - MODELO 5 - Portaria 321 - 8 mêses\",AB4<>\"BRINQUEDOS - MODELO 5 - Portaria 321 - 12 mêses\",AB4<>\"BRINQUEDOS - MODELO 1b - Portaria 321\"),\"Certificação concedida:\"))))))","v":"Certificação concedida:"},null,null,null,null,null,"Inserir data"]
[null,"Validade da certificação:",null,null,null,null,null,{"$f":"IF(H7=\"Inserir data\",\"\",IF(H7=\"\",\"\",EDATE(H7,AD4)-1))","v":""},null,null,null,null,null,null,null,null,null,null,null,null,null,null,null,null,null,null,null,"NUMERO DA \"/\" DO N° DO CERTIFICADO"]
[null,{"$f":"IF(OR(B2=\"Selecionar opção\",B2=\"Certificado de conformidade\",AB4=\"Selecionar opção\"),\"\",IF(AND(B2=\"Certificado de manutenção\",AB4=\"Berço - modelo 1b\"),\"\",\"Certificado de manutenção válido de:\"))","v":""},null,null,null,null,null,null,null,null,null,null,null,null,null,null,null,null,null,{"$f":"IF(B9=\"\",\"\",\"até\")","v":""},{"$f":"IF(K9=\"Inserir data\",\"\",IF(K9=\"\",\"\",EDATE(K9,18)-1))","v":""}]
[]
[null,"Solicitante:",null,null,"Selecionar cliente interessado"]
[null,"CNPJ:",null,null,{"$f":"IF(E11=\"Selecionar cliente interessado\",\"Falta informar solicitante\",VLOOKUP(E11,#REF!,2,0))","v":"Falta informar solicitante"}]
[null,"Endereço:",null,null,{"$f":"IF(E11=\"Selecionar cliente interessado\",\"Falta informar solicitante\",VLOOKUP(E11,#REF!,3,0))","v":"Falta informar solicitante"}]
[null,"CEP:",null,null,{"$f":"IF(E11=\"Selecionar cliente interessado\",\"Falta informar solicitante\",VLOOKUP(E11,#REF!,4,0))","v":"Falta informar solicitante"}]
[]
[null,"Fabricante:",null,null,"Inserir"]
[null,"Endereço:",null,null,"Inserir"]
[null,"País:",null,null,"Inserir"]
[]
[null,"Data da auditoria:",null,null,null,null,"Inserir",null,null,null,null,{"$f":"IF(AB4=\"Berço - Modelo 1b\",\"(Tratamento de reclamações)\",\"\")","v":""}]
[null,"Processo de decisão:",null,null,null,null,"Inserir IN",null,null,null,null,"Data:",null,null,"Inserir"]
[]
[null,"Laboratório:",null,null,"Selecionar laboratório de ensaios"]
[null,"Relatório de ensaio nº:",null,null,null,null,"Inserir"]
[null,"Data de emissão do relatório:",null,null,null,null,null,"Inserir"]
[null,{"$f":"IF(AB4=\"BERÇO - MODELO 1b\",\"Nº do edital:\",IF(AB4=\"CARRINHOS - MODELO 1b\",\"Nº do edital:\",IF(AB4=\"BRINQUEDOS - MODELO 1b - Portaria 563\",\"Nº do edital:\",IF(AB4=\"BRINQUEDOS - MODELO 1b - Portaria 321\",\"Nº do edital:\",IF(AB4=\"CADEIRA ALTA - MODELO 1b\",\"Nº do edital:\",IF(AB4=\"CPM - MODELO 1b\",\"Nº do edital:\",IF(AB4=\"PANELAS - MODELO 1b\",\"Nº do edital:\",IF(AB4=\"DRC - MODELO 1b\",\"Nº do edital:\",IF(AB4<>\"BERÇO - MODELO 1b\"\"CARRINHOS - MODELO 1b\"\"BRINQUEDOS - MODELO 1b - Portaria 563\"\"BRINQUEDOS - MODELO 1b - Portaria 321\"\"CADEIRA ALTA - MODELO 1b\"\"CPM - MODELO 1b\"\"DRC - MODELO 1b\"\"PANELAS - MODELO 1b\",\"\",IF(AB4=\"\",\"\"))))))))))","v":""},null,null,{"$f":"IF(B26=\"Nº do edital:\",\"Inserir\",\"\")","v":""},null,null,null,null,null,null,{"$f":"IF(AB4=\"BERÇO - MODELO 1b\",\"Licença de importação:\",IF(AB4=\"CARRINHOS - MODELO 1b\",\"Licença de importação:\",IF(AB4=\"BRINQUEDOS - MODELO 1b - Portaria 563\",\"Licença de importação:\",IF(AB4=\"BRINQUEDOS - MODELO 1b - Portaria 321\",\"Licença de importação:\",IF(AB4=\"CADEIRA ALTA - MODELO 1b\",\"Licença de importação:\",IF(AB4=\"CPM - MODELO 1b\",\"Licença de importação:\",IF(AB4=\"PANELAS - MODELO 1b\",\"Licença de importação:\",IF(AB4=\"DRC - MODELO 1b\",\"Licença de importação:\",IF(AB4<>\"BERÇO - MODELO 1b\"\"CARRINHOS - MODELO 1b\"\"BRINQUEDOS - MODELO 1b - Portaria 563\"\"BRINQUEDOS - MODELO 1b - Portaria 321\"\"CADEIRA ALTA - MODELO 1b\"\"CPM - MODELO 1b\"\"DRC - MODELO 1b\"\"PANELAS - MODELO 1b\",\"\",IF(AB4=\"\",\"\"))))))))))","v":""},null,null,null,null,null,null,null,{"$f":"IF(L26=\"Licença de importação:\",\"Inserir\",\"\")","v":""}]
[null,{"$f":"IF(AB4=\"BERÇO - MODELO 1b\",\"Identificação do lote:\",IF(AB4=\"CARRINHOS - MODELO 1b\",\"Identificação do lote:\",IF(AB4=\"BRINQUEDOS - MODELO 1b - Portaria 563\",\"Identificação do lote:\",IF(AB4=\"BRINQUEDOS - MODELO 1b - Portaria 321\",\"Identificação do lote:\",IF(AB4=\"CADEIRA ALTA - MODELO 1b\",\"Identificação do lote:\",IF(AB4=\"CPM - MODELO 1b\",\"Identificação do lote:\",IF(AB4=\"PANELAS - MODELO 1b\",\"Identificação do lote:\",IF(AB4=\"DRC - MODELO 1b\",\"Identificação do lote:\",IF(AB4<>\"BERÇO - MODELO 1b\"\"CARRINHOS - MODELO 1b\"\"BRINQUEDOS - MODELO 1b - Portaria 563\"\"BRINQUEDOS - MODELO 1b - Portaria 321\"\"CADEIRA ALTA - MODELO 1b\"\"CPM - MODELO 1b\"\"DRC - MODELO 1b\"\"PANELAS - MODELO 1b\",\"\",IF(AB4=\"\",\"\"))))))))))","v":""},null,null,null,null,{"$f":"IF(B27=\"Identificação do lote:\",\"Inserir\",\"\")","v":""}]
[null,{"$f":"IF(AB4=\"BERÇO - MODELO 1b\",\"Identificação do modelo:\",IF(AB4=\"CARRINHOS - MODELO 1b\",\"Identificação do modelo:\",IF(AB4=\"BRINQUEDOS - MODELO 1b - Portaria 563\",\"Identificação do modelo:\",IF(AB4=\"BRINQUEDOS - MODELO 1b - Portaria 321\",\"Identificação do modelo:\",IF(AB4=\"CADEIRA ALTA - MODELO 1b\",\"Identificação do modelo:\",IF(AB4=\"CPM - MODELO 1b\",\"Identificação do modelo:\",IF(AB4=\"PANELAS - MODELO 1b\",\"Identificação do modelo:\",IF(AB4=\"DRC - MODELO 1b\",\"Identificação do modelo:\",IF(AB4<>\"BERÇO - MODELO 1b\"\"CARRINHOS - MODELO 1b\"\"BRINQUEDOS - MODELO 1b - Portaria 563\"\"BRINQUEDOS - MODELO 1b - Portaria 321\"\"CADEIRA ALTA - MODELO 1b\"\"CPM - MODELO 1b\"\"DRC - MODELO 1b\"\"PANELAS - MODELO 1b\",\"\",IF(AB4=\"\",\"\"))))))))))","v":""},null,null,null,null,null,{"$f":"IF(B28=\"Identificação do modelo:\",\"Inserir\",\"\")","v":""}]
[null,null,null,null,null,null,null,null,null,null,null,null,null,null,null,null,null,null,"São Paulo,",null,"Inserir"]
[]
[]
[]
[]
[]
[null,"Nota 1: A validade deste Certificado está atrelada à realização das avaliações de manutenção e tratamento de possíveis não conformidades de acordo com as orientações do OCAN e somente acompanhado do anexo emitido por este organismo, estando sujeito às Portarias Inmetro. “Para verificação da condição atualizada de regularidade deste Certificado de Conformidade deve ser consultado o banco de dados de produtos e serviços certificados do Inmetro”. "]
[null,"Nota 2: “Certificado de Conformidade válido somente acompanhado das páginas de  01 a 02"]

{"sheet":"Anexo Berços","index":7,"n_rows":41,"n_cols":7,"rows_kept":41,"cut":false,"hidden":true,"merged":[[35,2,35,3],[35,4,35,5],[14,1,35,1],[32,2,32,3],[32,4,32,5],[33,2,33,3],[33,4,33,5],[34,2,34,3],[34,4,34,5],[29,2,29,3],[29,4,29,5],[30,2,30,3],[30,4,30,5],[31,2,31,3],[31,4,31,5],[26,2,26,3],[26,4,26,5],[27,2,27,3],[27,4,27,5],[28,2,28,3],[28,4,28,5],[2,1,2,5],[1,6,5,6],[6,6,14,6],[0,6,0,7],[7,1,7,5],[24,2,24,3],[24,4,24,5],[1,1,1,5],[12,3,13,5],[19,4,19,5],[18,4,18,5],[17,4,17,5],[16,4,16,5],[15,4,15,5],[14,4,14,5],[10,1,11,5],[12,2,13,2],[12,1,13,1],[25,2,25,3],[25,4,25,5],[23,2,23,3],[23,4,23,5],[20,2,20,3],[20,4,20,5],[21,2,21,3],[21,4,21,5],[22,2,22,3],[22,4,22,5]]}
[]
[null,{"$f":"'Certificados Gerais'!B2","v":"Selecionar opção"},null,null,null,null,{"$f":"'Certificados Gerais'!AA1","v":{"$error":"#N/A"}}]
[null,{"$f":"'Certificados Gerais'!B3","v":"Berços infantis"}]
[]
[null,"CERTIFICADO:",{"$f":"IF(IF('Certificados Gerais'!B2=\"CERTIFICADO DE CONFORMIDADE\",'Certificados Gerais'!G21,'Certificados Gerais'!AB6)=0,\"\",IF('Certificados Gerais'!B2=\"CERTIFICADO DE CONFORMIDADE\",'Certificados Gerais'!G21&'Certificados Gerais'!AB9,'Certificados Gerais'!AB6&'Certificados Gerais'!AB9))","v":""}]
[null,"EMISSÃO:",{"$f":"IF('Certificados Gerais'!$H$7=0,\"-\",'Certificados Gerais'!$H$7)","v":"Inserir data"}]
[null,"VALIDADE:",{"$f":"IF('Certificados Gerais'!$H$7=0,\"-\",'Certificados Gerais'!$H$8)","v":""},null,null,null,{"$f":"'Certificados Gerais'!AA4","v":{"$error":"#N/A"}}]
[null,{"$f":"IF(B2=\"CERTIFICADO DE MANUTENÇÃO\",\"CERTIFICADO DE MANUTENÇÃO VÁLIDO DE:\"&\"   \"&CONCATENATE(TEXT('Certificados Gerais'!K9,\"dd-mm-aaaa\"),\"  a  \",TEXT('Certificados Gerais'!U9,\"dd-mm-aaaa\")),\"\")","v":""}]
[]
[]
[null,"Nota 2: “Certificado de Conformidade válido somente acompanhado das páginas de  1 a 2"]
[]
[null,"Marca","Modelo","Descrição Técnica do Modelo"]
[]
[null,{"$f":"'MEMORIAL DESCRITIVO'!E5","v":"-"},"Designação Comercial","Material:",{"$f":"'MEMORIAL DESCRITIVO'!F30","v":"-"}]
[null,null,{"$f":"'MEMORIAL DESCRITIVO'!E6","v":"-"},"Dimensões:",{"$f":"'MEMORIAL DESCRITIVO'!F31","v":"-"}]
[null,null,"Código de referência comercial","Sistema de Travamento:",{"$f":"'MEMORIAL DESCRITIVO'!F32","v":"-"}]
[null,null,{"$f":"'MEMORIAL DESCRITIVO'!E4","v":"-"},"Tipo do Berço:",{"$f":"'MEMORIAL DESCRITIVO'!F29","v":"-"}]
[null,null,"Quantidade:","Sistema de Montagem e Ferragem:",{"$f":"'MEMORIAL DESCRITIVO'!F33","v":"-"}]
[null,null,null,"Acessórios:"]
[null,null,"Versões",null,"Código de Barras"]
[null,null,{"$f":"'Cor - Versões - Código de Barra'!C3","v":"-"},null,{"$f":"'Cor - Versões - Código de Barra'!D3","v":"-"}]
[null,null,{"$f":"'Cor - Versões - Código de Barra'!C4","v":"-"},null,{"$f":"'Cor - Versões - Código de Barra'!D4","v":"-"}]
[null,null,{"$f":"'Cor - Versões - Código de Barra'!C5","v":"-"},null,{"$f":"'Cor - Versões - Código de Barra'!D5","v":"-"}]
[null,null,{"$f":"'Cor - Versões - Código de Barra'!C6","v":"-"},null,{"$f":"'Cor - Versões - Código de Barra'!D6","v":"-"}]
[null,null,{"$f":"'Cor - Versões - Código de Barra'!C7","v":"-"},null,{"$f":"'Cor - Versões - Código de Barra'!D7","v":"-"}]
[null,null,{"$f":"'Cor - Versões - Código de Barra'!C8","v":"-"},null,{"$f":"'Cor - Versões - Código de Barra'!D8","v":"-"}]
[null,null,{"$f":"'Cor - Versões - Código de Barra'!C9","v":"-"},null,{"$f":"'Cor - Versões - Código de Barra'!D9","v":"-"}]
[null,null,{"$f":"'Cor - Versões - Código de Barra'!C10","v":"-"},null,{"$f":"'Cor - Versões - Código de Barra'!D10","v":"-"}]
[null,null,{"$f":"'Cor - Versões - Código de Barra'!C11","v":"-"},null,{"$f":"'Cor - Versões - Código de Barra'!D11","v":"-"}]
[null,null,{"$f":"'Cor - Versões - Código de Barra'!C12","v":"-"},null,{"$f":"'Cor - Versões - Código de Barra'!D12","v":"-"}]
[null,null,{"$f":"'Cor - Versões - Código de Barra'!C13","v":"-"},null,{"$f":"'Cor - Versões - Código de Barra'!D13","v":"-"}]
[null,null,{"$f":"'Cor - Versões - Código de Barra'!C14","v":"-"},null,{"$f":"'Cor - Versões - Código de Barra'!D14","v":"-"}]
[null,null,{"$f":"'Cor - Versões - Código de Barra'!C15","v":"-"},null,{"$f":"'Cor - Versões - Código de Barra'!D15","v":"-"}]
[null,null,{"$f":"'Cor - Versões - Código de Barra'!C16","v":"-"},null,{"$f":"'Cor - Versões - Código de Barra'!D16","v":"-"}]
[null,null,{"$f":"'Cor - Versões - Código de Barra'!C17","v":"-"},null,{"$f":"'Cor - Versões - Código de Barra'!D17","v":"-"}]
[]
[]
[]
[]
[null,null,"."]